Target
Glutamate receptor ionotropic, kainate 3
Ligand
BDBM50207594
Substrate
Meas. Tech.
ChEMBL_326526 (CHEMBL862731)
IC50
44000±n/a nM
Citation
 Dolman, NPTroop, HMMore, JCAlt, AKnauss, JLNistico, RJack, SMorley, RMBortolotto, ZARoberts, PJBleakman, DCollingridge, GLJane, DE Synthesis and pharmacology of willardiine derivatives acting as antagonists of kainate receptors. J Med Chem 48:7867-81 (2005)  
Target
Name:
Glutamate receptor ionotropic, kainate 3
Synonyms:
EAA5 GLUR7 GRIK3_HUMAN Glutamate receptor 7 Glutamate receptor ionotropic kainate 3 Glutamate-Kainate 7
Type:
Enzyme Catalytic Domain
Mol. Mass.:
104046.44
Organism:
Homo sapiens (Human)
Description:
Glutamate-Kainate 7 0 HUMAN::Q13003
Residue:
919
  
Inhibitor
Name:
BDBM50207594
Synonyms:
2,3-Dihydroxy-6-nitro-benzo[f]quinoxaline-7-sulfonic acid amide 2,3-dihydroxy-6-nitro-7-sulfamoylbenzo(f)quinoxaline 6-Nitro-2,3-dioxo-1,2,3,4,4a,10b-hexahydro-benzo[f]quinoxaline-7-sulfonic acid amide 6-Nitro-2,3-dioxo-1,2,3,4-tetrahydro-benzo[f]quinoxaline-7-sulfonic acid amide 6-nitro-2,3-dioxo-1,2,3,4-tetrahydrobenzo[f]quinoxaline-7-sulfonamide | CHEMBL222519
Type:
Small organic molecule
Emp. Form.:
C12H8N4O6S
Mol. Mass.:
336.28
SMILES:
NS(=O)(=O)c1cccc2c1c(cc1[nH]c(=O)c(=O)[nH]c21)[N+]([O-])=O
: