Target
Glutamate receptor ionotropic, kainate 2
Ligand
BDBM50178144
Substrate
Meas. Tech.
ChEMBL_326525 (CHEMBL862730)
Ki
>100000±n/a nM
Citation
 Dolman, NPTroop, HMMore, JCAlt, AKnauss, JLNistico, RJack, SMorley, RMBortolotto, ZARoberts, PJBleakman, DCollingridge, GLJane, DE Synthesis and pharmacology of willardiine derivatives acting as antagonists of kainate receptors. J Med Chem 48:7867-81 (2005)  
Target
Name:
Glutamate receptor ionotropic, kainate 2
Synonyms:
GRIK2_RAT Glutamate receptor ionotropic kainate 2 Ionotropic glutamate receptor kainate 2/5
Type:
PROTEIN
Mol. Mass.:
102478.61
Organism:
Rattus norvegicus
Description:
ChEMBL_936439
Residue:
908
  
Inhibitor
Name:
BDBM50178144
Synonyms:
(S)-3-(2-amino-2-carboxyethyl)-1-carboxymethylpyrimidine-2,4-dione | CHEMBL199233
Type:
Small organic molecule
Emp. Form.:
C9H11N3O6
Mol. Mass.:
257.2001
SMILES:
N[C@@H](Cn1c(=O)ccn(CC(O)=O)c1=O)C(O)=O
: