Target
Aurora kinase A
Ligand
BDBM50181547
Substrate
Meas. Tech.
ChEMBL_420088 (CHEMBL873731)
IC50
1±n/a nM
Citation
 Jung, FHPasquet, GLambert-van der Brempt, CLohmann, JJWarin, NRenaud, FGermain, HDe Savi, CRoberts, NJohnson, TDousson, CHill, GBMortlock, AAHeron, NWilkinson, RWWedge, SRHeaton, SPOdedra, RKeen, NJGreen, SBrown, EThompson, KBrightwell, S Discovery of novel and potent thiazoloquinazolines as selective Aurora A and B kinase inhibitors. J Med Chem 49:955-70 (2006)  
Target
Name:
Aurora kinase A
Synonyms:
AIK ARK-1 AURA AURKA_HUMAN Aurora 2 Aurora kinase A (AURKA) Aurora kinase A (Aurora-2) Aurora/IPL1-related kinase 1 Breast tumor-amplified kinase IAK1 STK15 GN Serine/threonine kinase 15 Serine/threonine-protein kinase 6 Serine/threonine-protein kinase aurora-A aurora-2 | hARK1
Type:
Serine/threonine-protein kinase
Mol. Mass.:
45830.98
Organism:
Homo sapiens (Human)
Description:
O14965
Residue:
403
  
Inhibitor
Name:
BDBM50181547
Synonyms:
CHEMBL202567 | N-(4-fluorophenyl)-2-{[6-methoxy-7-(3-morpholin-4-ylpropoxy)quinazolin-4-yl]amino}-1,3-thiazole-5-carboxamide
Type:
Small organic molecule
Emp. Form.:
C26H27FN6O4S
Mol. Mass.:
538.594
SMILES:
COc1cc2c(Nc3ncc(s3)C(=O)Nc3ccc(F)cc3)ncnc2cc1OCCCN1CCOCC1
: