Target
Beta-1 adrenergic receptor
Ligand
BDBM50181836
Substrate
Meas. Tech.
ChEMBL_332086 (CHEMBL858808)
IC50
>10000±n/a nM
Citation
 Becker, DPFlynn, DLMoormann, AENosal, RVillamil, CILoeffler, RGullikson, GWMoummi, CYang, DC Pyrrolizidine esters and amides as 5-HT4 receptor agonists and antagonists. J Med Chem 49:1125-39 (2006)  
Target
Name:
Beta-1 adrenergic receptor
Synonyms:
ADRB1 ADRB1_HUMAN Beta-1 adrenoceptor adrenergic Beta1
Type:
G Protein-Coupled Receptor (GPCR)
Mol. Mass.:
51338.40
Organism:
Homo sapiens (Human)
Description:
P08588
Residue:
477
  
Inhibitor
Name:
BDBM50181836
Synonyms:
4-Amino-N-(1-aza-tricyclo[3.3.1.0*3,7*]non-4-yl)-5-chloro-2-methoxy-benzamide 4-Amino-N-(1R,3S,4R,7R)-1-aza-tricyclo[3.3.1.0*3,7*]non-4-yl-5-chloro-2-methoxy-benzamide BDBM50449569 CHEMBL319673 | SC-52491
Type:
Small organic molecule
Emp. Form.:
C16H20ClN3O2
Mol. Mass.:
321.802
SMILES:
COc1cc(N)c(Cl)cc1C(=O)N[C@@H]1C2CC3CN(CC13)C2
: