Target
Adenosine receptor A2b
Ligand
BDBM50183520
Substrate
Meas. Tech.
ChEMBL_337185 (CHEMBL862545)
IC50
244±n/a nM
Citation
 Pastorin, GDa Ros, TBolcato, CMontopoli, CMoro, SCacciari, BBaraldi, PGVarani, KBorea, PASpalluto, G Synthesis and biological studies of a new series of 5-heteroarylcarbamoylaminopyrazolo[4,3-e]1,2,4-triazolo[1,5-c]pyrimidines as human A3 adenosine receptor antagonists. Influence of the heteroaryl substituent on binding affinity and molecular modeling investigations. J Med Chem 49:1720-9 (2006)  
Target
Name:
Adenosine receptor A2b
Synonyms:
AA2BR_HUMAN ADORA2B Adenosine receptors A2b | Adenosine receptors; A2a & A2b
Type:
G Protein-Coupled Receptor (GPCR)
Mol. Mass.:
36341.22
Organism:
Homo sapiens (Human)
Description:
Residue:
332
  
Inhibitor
Name:
BDBM50183520
Synonyms:
3-[3-(2-furan-2-yl-8-methy-8H-pyrazolo[4,3-e][1,2,4]triazolo-[1,5-c]pyrimidin-5-yl)-ureido]-N-methylpyridinium iodide | CHEMBL203660
Type:
Small organic molecule
Emp. Form.:
C18H16N9O2
Mol. Mass.:
390.3782
SMILES:
Cn1cc2c(n1)nc(NC(=O)Nc1ccc[n+](C)c1)n1nc(nc21)-c1ccco1
: