Target
Gag-Pol polyprotein [489-587]
Ligand
BDBM4690
Substrate
Meas. Tech.
ChEMBL_345068 (CHEMBL869622)
Ki
0.000006±n/a nM
Citation
 Miller, JFAndrews, CWBrieger, MFurfine, ESHale, MRHanlon, MHHazen, RJKaldor, IMcLean, EWReynolds, DSammond, DMSpaltenstein, ATung, RTurner, EMXu, RXSherrill, RG Ultra-potent P1 modified arylsulfonamide HIV protease inhibitors: the discovery of GW0385. Bioorg Med Chem Lett 16:1788-94 (2006)  
Target
Name:
Gag-Pol polyprotein [489-587]
Synonyms:
Human immunodeficiency virus type 1 protease Pol polyprotein | gag-pol
Type:
Enzyme Subunit
Mol. Mass.:
10781.16
Organism:
Human immunodeficiency virus type 1
Description:
P04585[489-587]
Residue:
99
  
Inhibitor
Name:
BDBM4690
Synonyms:
(3R,3aS,6aR)-hexahydrofuro[2,3-b]furan-3-yl N-[(2S,3R)-4-[2H-1,3-benzodioxole-5-(2-methylpropyl)sulfonamido]-3-hydroxy-1-[4-(pyridin-2-ylmethoxy)phenyl]butan-2-yl]carbamate | GW0385 analog 5
Type:
Small organic molecule
Emp. Form.:
C34H41N3O10S
Mol. Mass.:
683.768
SMILES:
[H][C@@]12CCO[C@]1([H])OC[C@@H]2OC(=O)N[C@@H](Cc1ccc(OCc2ccccn2)cc1)[C@H](O)CN(CC(C)C)S(=O)(=O)c1ccc2OCOc2c1
: