Target
Prothrombin
Ligand
BDBM50182201
Substrate
Meas. Tech.
ChEMBL_354267 (CHEMBL870018)
IC50
1.8±n/a nM
Citation
 Lange, UEBaucke, DHornberger, WMack, HSeitz, WHöffken, HW Orally active thrombin inhibitors. Part 2: optimization of the P2-moiety. Bioorg Med Chem Lett 16:2648-53 (2006)  
Target
Name:
Prothrombin
Synonyms:
Activation peptide fragment 1 Coagulation factor II Prothrombin precursor Thrombin heavy chain | Thrombin light chain
Type:
Protein
Mol. Mass.:
70029.57
Organism:
Homo sapiens (Human)
Description:
P00734
Residue:
622
  
Inhibitor
Name:
BDBM50182201
Synonyms:
((R)-2-{(S)-2-[(6-carbamimidoyl-pyridin-3-ylmethyl)-carbamoyl]-2,5-dihydro-pyrrol-1-yl}-1-cyclohexylmethyl-2-oxo-ethylamino)-acetic acid CHEMBL377681
Type:
Small organic molecule
Emp. Form.:
C23H32N6O4
Mol. Mass.:
456.538
SMILES:
NC(=N)c1ccc(CNC(=O)[C@@H]2C=CCN2C(=O)[C@@H](CC2CCCCC2)NCC(O)=O)cn1
: