Target
3-hydroxyacyl-[acyl-carrier-protein] dehydratase
Ligand
BDBM9461
Substrate
Meas. Tech.
ChEMBL_361103 (CHEMBL859169)
IC50
8000±n/a nM
Citation
 Tasdemir, DLack, GBrun, RRüedi, PScapozza, LPerozzo, R Inhibition of Plasmodium falciparum fatty acid biosynthesis: evaluation of FabG, FabZ, and FabI as drug targets for flavonoids. J Med Chem 49:3345-53 (2006)  
Target
Name:
3-hydroxyacyl-[acyl-carrier-protein] dehydratase
Synonyms:
Fatty acid synthase
Type:
PROTEIN
Mol. Mass.:
26222.50
Organism:
Plasmodium falciparum
Description:
ChEMBL_983601
Residue:
230
  
Inhibitor
Name:
BDBM9461
Synonyms:
5,7-dihydroxy-3-(4-methoxyphenyl)-4H-chromen-4-one Biochanin A (BCA) CHEMBL131921 | cid_5280373
Type:
Small organic molecule
Emp. Form.:
C16H12O5
Mol. Mass.:
284.2635
SMILES:
COc1ccc(cc1)-c1coc2cc(O)cc(O)c2c1=O
: