Target
Transient receptor potential cation channel subfamily V member 1
Ligand
BDBM50188674
Substrate
Meas. Tech.
ChEMBL_364425 (CHEMBL870233)
IC50
1.4±n/a nM
Citation
 Ognyanov, VIBalan, CBannon, AWBo, YDominguez, CFotsch, CGore, VKKlionsky, LMa, VVQian, YXTamir, RWang, XXi, NXu, SZhu, DGavva, NRTreanor, JJNorman, MH Design of potent, orally available antagonists of the transient receptor potential vanilloid 1. Structure-activity relationships of 2-piperazin-1-yl-1H-benzimidazoles. J Med Chem 49:3719-42 (2006)  
Target
Name:
Transient receptor potential cation channel subfamily V member 1
Synonyms:
Capsaicin receptor TRPV1_RAT Trpv1 Vanilloid VR1 Vanilloid receptor 1 (VRI/TRPV1) Vanilloid receptor type 1-like (TrpV1/Vr1) Vr1l | osm-9-like TRP channel 1
Type:
Transient Receptor
Mol. Mass.:
94956.12
Organism:
Rattus norvegicus (rat)
Description:
O35433
Residue:
838
  
Inhibitor
Name:
BDBM50188674
Synonyms:
(R)-(6-(3-methyl-4-(6-(trifluoromethyl)-4-(3,4,5-trifluorophenyl)-1H-benzo[d]imidazol-2-yl)piperazin-1-yl)-5-(trifluoromethyl)pyridin-3-yl)methanol ( | CHEMBL379131
Type:
Small organic molecule
Emp. Form.:
C26H20F9N5O
Mol. Mass.:
589.4555
SMILES:
C[C@@H]1CN(CCN1c1nc2c(cc(cc2[nH]1)C(F)(F)F)-c1cc(F)c(F)c(F)c1)c1ncc(CO)cc1C(F)(F)F
: