Target
Transient receptor potential cation channel subfamily V member 1
Ligand
BDBM50188701
Substrate
Meas. Tech.
ChEMBL_364426 (CHEMBL870234)
IC50
21±n/a nM
Citation
 Ognyanov, VIBalan, CBannon, AWBo, YDominguez, CFotsch, CGore, VKKlionsky, LMa, VVQian, YXTamir, RWang, XXi, NXu, SZhu, DGavva, NRTreanor, JJNorman, MH Design of potent, orally available antagonists of the transient receptor potential vanilloid 1. Structure-activity relationships of 2-piperazin-1-yl-1H-benzimidazoles. J Med Chem 49:3719-42 (2006)  
Target
Name:
Transient receptor potential cation channel subfamily V member 1
Synonyms:
Capsaicin receptor TRPV1_RAT Trpv1 Vanilloid VR1 Vanilloid receptor 1 (VRI/TRPV1) Vanilloid receptor type 1-like (TrpV1/Vr1) Vr1l | osm-9-like TRP channel 1
Type:
Transient Receptor
Mol. Mass.:
94956.12
Organism:
Rattus norvegicus (rat)
Description:
O35433
Residue:
838
  
Inhibitor
Name:
BDBM50188701
Synonyms:
4-piperidin-1-yl-6-(trifluoromethyl)-2-(4-(3-(trifluoromethyl)-pyridin-2-yl)piperazin-1-yl)-1H-benzo[d]imidazole | CHEMBL210086
Type:
Small organic molecule
Emp. Form.:
C23H24F6N6
Mol. Mass.:
498.4673
SMILES:
FC(F)(F)c1cc(N2CCCCC2)c2nc([nH]c2c1)N1CCN(CC1)c1ncccc1C(F)(F)F
: