Target
Transient receptor potential cation channel subfamily V member 1
Ligand
BDBM50188711
Substrate
Meas. Tech.
ChEMBL_364426 (CHEMBL870234)
IC50
2.3±n/a nM
Citation
 Ognyanov, VIBalan, CBannon, AWBo, YDominguez, CFotsch, CGore, VKKlionsky, LMa, VVQian, YXTamir, RWang, XXi, NXu, SZhu, DGavva, NRTreanor, JJNorman, MH Design of potent, orally available antagonists of the transient receptor potential vanilloid 1. Structure-activity relationships of 2-piperazin-1-yl-1H-benzimidazoles. J Med Chem 49:3719-42 (2006)  
Target
Name:
Transient receptor potential cation channel subfamily V member 1
Synonyms:
Capsaicin receptor TRPV1_RAT Trpv1 Vanilloid VR1 Vanilloid receptor 1 (VRI/TRPV1) Vanilloid receptor type 1-like (TrpV1/Vr1) Vr1l | osm-9-like TRP channel 1
Type:
Transient Receptor
Mol. Mass.:
94956.12
Organism:
Rattus norvegicus (rat)
Description:
O35433
Residue:
838
  
Inhibitor
Name:
BDBM50188711
Synonyms:
(R)-1-(5-chloro-6-((R)-3-methyl-4-(6-(trifluoromethyl)-4-(3,4,5-trifluorophenyl)-1H-benzo[d]imidazol-2-yl)piperazin-1-yl)pyridin-3-yl)ethanol | CHEMBL378463
Type:
Small organic molecule
Emp. Form.:
C26H22ClF6N5O
Mol. Mass.:
569.929
SMILES:
C[C@@H](O)c1cnc(N2CCN([C@H](C)C2)c2nc3c(cc(cc3[nH]2)C(F)(F)F)-c2cc(F)c(F)c(F)c2)c(Cl)c1
: