Target
D(4) dopamine receptor
Ligand
BDBM50189838
Substrate
Meas. Tech.
ChEMBL_367039 (CHEMBL866802)
Ki
500±n/a nM
Citation
 Enguehard-Gueiffier, CHübner, HEl Hakmaoui, AAllouchi, HGmeiner, PArgiolas, AMelis, MRGueiffier, A 2-[(4-phenylpiperazin-1-yl)methyl]imidazo(di)azines as selective D4-ligands. Induction of penile erection by 2-[4-(2-methoxyphenyl)piperazin-1-ylmethyl]imidazo[1,2-a]pyridine (PIP3EA), a potent and selective D4 partial agonist. J Med Chem 49:3938-47 (2006)  
Target
Name:
D(4) dopamine receptor
Synonyms:
D(2C) dopamine receptor DOPAMINE D4.2 DRD4 Dopamine D4 receptor
Type:
Enzyme
Mol. Mass.:
48373.19
Organism:
Homo sapiens (Human)
Description:
P21917
Residue:
419
  
Inhibitor
Name:
BDBM50189838
Synonyms:
2-[4-(4-fluorophenyl)piperazin-1-ylmethyl]imidazo[1,2-a]pyrazine | CHEMBL377542
Type:
Small organic molecule
Emp. Form.:
C17H18FN5
Mol. Mass.:
311.3567
SMILES:
Fc1ccc(cc1)N1CCN(Cc2cn3ccncc3n2)CC1
: