Target
Gonadotropin-releasing hormone receptor
Ligand
BDBM50189706
Substrate
Meas. Tech.
ChEMBL_367960 (CHEMBL871108)
IC50
30±n/a nM
Citation
 Imada, TCho, NImaeda, THayase, YSasaki, SKasai, SHarada, MMatsumoto, HEndo, SSuzuki, NFuruya, S Design, synthesis, and structure-activity relationships of thieno[2,3-b]pyridin-4-one derivatives as a novel class of potent, orally active, non-peptide luteinizing hormone-releasing hormone receptor antagonists. J Med Chem 49:3809-25 (2006)  
Target
Name:
Gonadotropin-releasing hormone receptor
Synonyms:
GNRHR GRHR GnRH-R Gonadotropin-releasing hormone receptor | Gonadotropin-releasing hormone receptor (GnRH)
Type:
Enzyme
Mol. Mass.:
37749.45
Organism:
Homo sapiens (Human)
Description:
P30968
Residue:
328
  
Inhibitor
Name:
BDBM50189706
Synonyms:
CHEMBL210277 | ethyl 7-(2-fluorobenzyl)-3-((benzyl(methyl)amino)methyl)-2-(4-methoxyphenyl)-4-oxo-4,7-dihydrothieno[2,3-b]pyridine-5-carboxylate
Type:
Small organic molecule
Emp. Form.:
C33H31FN2O4S
Mol. Mass.:
570.674
SMILES:
CCOC(=O)c1cn(Cc2ccccc2F)c2sc(c(CN(C)Cc3ccccc3)c2c1=O)-c1ccc(OC)cc1
: