Target
Gonadotropin-releasing hormone receptor
Ligand
BDBM50189708
Substrate
Meas. Tech.
ChEMBL_367962 (CHEMBL871111)
IC50
7±n/a nM
Citation
 Imada, TCho, NImaeda, THayase, YSasaki, SKasai, SHarada, MMatsumoto, HEndo, SSuzuki, NFuruya, S Design, synthesis, and structure-activity relationships of thieno[2,3-b]pyridin-4-one derivatives as a novel class of potent, orally active, non-peptide luteinizing hormone-releasing hormone receptor antagonists. J Med Chem 49:3809-25 (2006)  
Target
Name:
Gonadotropin-releasing hormone receptor
Synonyms:
GNRHR_RAT GnRH-R | Gnrhr
Type:
PROTEIN
Mol. Mass.:
37767.60
Organism:
Rattus norvegicus
Description:
ChEMBL_1335047
Residue:
327
  
Inhibitor
Name:
BDBM50189708
Synonyms:
(S)-1-((S)-2-((S)-2-(2-((S)-2-((S)-2-((S)-2-((S)-3-(1H-imidazol-5-yl)-2-((S)-2-oxopyrrolidine-5-carboxamido)propanamido)-3-(1H-indol-2-yl)propanamido)-3-hydroxypropanamido)-3-(4-hydroxyphenyl)propanamido)acetamido)-4-methylpentanamido)-5-(diaminomethylene | CHEMBL438652
Type:
Small organic molecule
Emp. Form.:
C53H72N16O12
Mol. Mass.:
1125.2388
SMILES:
CC(C)C[C@H](NC(=O)CNC(=O)[C@H](Cc1ccc(O)cc1)NC(=O)[C@H](CO)NC(=O)[C@H](Cc1cc2ccccc2[nH]1)NC(=O)[C@H](Cc1cnc[nH]1)NC(=O)[C@@H]1CCC(=O)N1)C(=O)N[C@@H](CCCN=C(N)N)C(=O)N1CCC[C@H]1C(N)=O
: