Target
Gonadotropin-releasing hormone receptor
Ligand
BDBM50189712
Substrate
Meas. Tech.
ChEMBL_367960 (CHEMBL871108)
IC50
0.4±n/a nM
Citation
 Imada, TCho, NImaeda, THayase, YSasaki, SKasai, SHarada, MMatsumoto, HEndo, SSuzuki, NFuruya, S Design, synthesis, and structure-activity relationships of thieno[2,3-b]pyridin-4-one derivatives as a novel class of potent, orally active, non-peptide luteinizing hormone-releasing hormone receptor antagonists. J Med Chem 49:3809-25 (2006)  
Target
Name:
Gonadotropin-releasing hormone receptor
Synonyms:
GNRHR GRHR GnRH-R Gonadotropin-releasing hormone receptor | Gonadotropin-releasing hormone receptor (GnRH)
Type:
Enzyme
Mol. Mass.:
37749.45
Organism:
Homo sapiens (Human)
Description:
P30968
Residue:
328
  
Inhibitor
Name:
BDBM50189712
Synonyms:
CHEMBL379198 | ethyl 3-(N-benzyl-N-methylaminomethyl)-4,7-dihydro-7-(2-fluorobenzyl)-4-oxo-2-(4-propionylamidophenyl)thieno[2,3-b]pyridine-5-carboxylate
Type:
Small organic molecule
Emp. Form.:
C35H35N3O4S
Mol. Mass.:
593.735
SMILES:
CCOC(=O)c1cn(Cc2ccccc2)c2sc(c(CN(C)Cc3ccccc3)c2c1=O)-c1ccc(NC(=O)CC)cc1
: