Target
Gonadotropin-releasing hormone receptor
Ligand
BDBM50189726
Substrate
Meas. Tech.
ChEMBL_367960 (CHEMBL871108)
IC50
2±n/a nM
Citation
 Imada, TCho, NImaeda, THayase, YSasaki, SKasai, SHarada, MMatsumoto, HEndo, SSuzuki, NFuruya, S Design, synthesis, and structure-activity relationships of thieno[2,3-b]pyridin-4-one derivatives as a novel class of potent, orally active, non-peptide luteinizing hormone-releasing hormone receptor antagonists. J Med Chem 49:3809-25 (2006)  
Target
Name:
Gonadotropin-releasing hormone receptor
Synonyms:
GNRHR GRHR GnRH-R Gonadotropin-releasing hormone receptor | Gonadotropin-releasing hormone receptor (GnRH)
Type:
Enzyme
Mol. Mass.:
37749.45
Organism:
Homo sapiens (Human)
Description:
P30968
Residue:
328
  
Inhibitor
Name:
BDBM50189726
Synonyms:
CHEMBL264574 | ethyl 3-(N-benzyl-N-methylaminomethyl)-4,7-dihydro-2-[4-(1,3-dimethyluriedo)phenyl]-7-(2-fluorobenzyl)-4-oxo-thieno[2,3-b]pyridine-5-carboxylate
Type:
Small organic molecule
Emp. Form.:
C35H36N4O4S
Mol. Mass.:
608.75
SMILES:
CCOC(=O)c1cn(Cc2ccccc2)c2sc(c(CN(C)Cc3ccccc3)c2c1=O)-c1ccc(cc1)N(C)C(=O)NC
: