Target
Receptor tyrosine-protein kinase erbB-2
Ligand
BDBM50189109
Substrate
Meas. Tech.
ChEMBL_396272 (CHEMBL910356)
IC50
18±n/a nM
Citation
 Petrov, KGZhang, YMCarter, MCockerill, GSDickerson, SGauthier, CAGuo, YMook, RARusnak, DWWalker, ALWood, ERLackey, KE Optimization and SAR for dual ErbB-1/ErbB-2 tyrosine kinase inhibition in the 6-furanylquinazoline series. Bioorg Med Chem Lett 16:4686-91 (2006)  
Target
Name:
Receptor tyrosine-protein kinase erbB-2
Synonyms:
2.7.10.1 CD_antigen=CD340 ERBB2_HUMAN FASN/HER2 HER2 MLN19 NEU Proto-oncogene Neu Tyrosine kinase-type cell surface receptor HER2 | p185erbB2
Type:
Mol. Mass.:
137894.47
Organism:
Homo sapiens (Human)
Description:
P04626
Residue:
1255
  
Inhibitor
Name:
BDBM50189109
Synonyms:
CHEMBL212954 | [3-chloro-4-(3-fluoro-benzyloxy)-phenyl]-{6-[5-(1-oxo-1lambda*4*-thiomorpholin-4-ylmethyl)-furan-2-yl]-quinazolin-4-yl}-amine
Type:
Small organic molecule
Emp. Form.:
C30H26ClFN4O3S
Mol. Mass.:
577.069
SMILES:
Fc1cccc(COc2ccc(Nc3ncnc4ccc(cc34)-c3ccc(CN4CCS(=O)CC4)o3)cc2Cl)c1
: