Target
Cyclin-dependent kinase 4
Ligand
BDBM6619
Substrate
Meas. Tech.
ChEMBL_404507 (CHEMBL910890)
IC50
42±n/a nM
Citation
 Kawanishi, NSugimoto, TShibata, JNakamura, KMasutani, KIkuta, MHirai, H Structure-based drug design of a highly potent CDK1,2,4,6 inhibitor with novel macrocyclic quinoxalin-2-one structure. Bioorg Med Chem Lett 16:5122-6 (2006)  
Target
Name:
Cyclin-dependent kinase 4
Synonyms:
CDK4 Cell division protein kinase 4 PSK-J3
Type:
Enzyme Subunit
Mol. Mass.:
33731.96
Organism:
Homo sapiens (Human)
Description:
P11802
Residue:
303
  
Inhibitor
Name:
BDBM6619
Synonyms:
3-[(9bR)-5-oxo-1H,2H,3H,5H,9bH-benzo[a]pyrrolizin-9-yl]-1-pyridin-2-ylurea N -(pyrrolidino[2,1-b]isoindolin-4-on-8-yl)-N-(pyridin-2yl)urea diarylurea deriv. 1
Type:
Small organic molecule
Emp. Form.:
C17H16N4O2
Mol. Mass.:
308.3345
SMILES:
O=C(Nc1ccccn1)Nc1cccc2C(=O)N3CCC[C@@H]3c12
: