Target
Cyclin-dependent kinase 4
Ligand
BDBM50192079
Substrate
Meas. Tech.
ChEMBL_404507 (CHEMBL910890)
IC50
480±n/a nM
Citation
 Kawanishi, NSugimoto, TShibata, JNakamura, KMasutani, KIkuta, MHirai, H Structure-based drug design of a highly potent CDK1,2,4,6 inhibitor with novel macrocyclic quinoxalin-2-one structure. Bioorg Med Chem Lett 16:5122-6 (2006)  
Target
Name:
Cyclin-dependent kinase 4
Synonyms:
CDK4 Cell division protein kinase 4 PSK-J3
Type:
Enzyme Subunit
Mol. Mass.:
33731.96
Organism:
Homo sapiens (Human)
Description:
P11802
Residue:
303
  
Inhibitor
Name:
BDBM50192079
Synonyms:
9-(3-oxo-3,4-dihydro-quinoxalin-2-yl)-1,2,3,9b-tetrahydro-pyrrolo[2,1-a]isoindol-5-one | CHEMBL385362
Type:
Small organic molecule
Emp. Form.:
C19H15N3O2
Mol. Mass.:
317.3413
SMILES:
O=C1N2CCCC2c2c1cccc2-c1nc2ccccc2[nH]c1=O
: