Target
Cyclin-dependent kinase 4
Ligand
BDBM50192077
Substrate
Meas. Tech.
ChEMBL_404507 (CHEMBL910890)
IC50
11±n/a nM
Citation
 Kawanishi, NSugimoto, TShibata, JNakamura, KMasutani, KIkuta, MHirai, H Structure-based drug design of a highly potent CDK1,2,4,6 inhibitor with novel macrocyclic quinoxalin-2-one structure. Bioorg Med Chem Lett 16:5122-6 (2006)  
Target
Name:
Cyclin-dependent kinase 4
Synonyms:
CDK4 Cell division protein kinase 4 PSK-J3
Type:
Enzyme Subunit
Mol. Mass.:
33731.96
Organism:
Homo sapiens (Human)
Description:
P11802
Residue:
303
  
Inhibitor
Name:
BDBM50192077
Synonyms:
23-hydroxy-16-oxa-8-thia-9,22,24-triazapentacyclo[15.6.2.1^{6,9}.0^{2,7}.0^{21,25}]hexacosa-1(24),2(7),3,5,17(25),18,20,22-octaen-26-one | CHEMBL424722
Type:
Small organic molecule
Emp. Form.:
C21H19N3O3S
Mol. Mass.:
393.459
SMILES:
O=c1n2CCCCCCOc3cccc4[nH]c(=O)c(nc34)-c3cccc1c3s2
: