Target
Cyclin-dependent kinase 4
Ligand
BDBM50192072
Substrate
Meas. Tech.
ChEMBL_404507 (CHEMBL910890)
IC50
29±n/a nM
Citation
 Kawanishi, NSugimoto, TShibata, JNakamura, KMasutani, KIkuta, MHirai, H Structure-based drug design of a highly potent CDK1,2,4,6 inhibitor with novel macrocyclic quinoxalin-2-one structure. Bioorg Med Chem Lett 16:5122-6 (2006)  
Target
Name:
Cyclin-dependent kinase 4
Synonyms:
CDK4 Cell division protein kinase 4 PSK-J3
Type:
Enzyme Subunit
Mol. Mass.:
33731.96
Organism:
Homo sapiens (Human)
Description:
P11802
Residue:
303
  
Inhibitor
Name:
BDBM50192072
Synonyms:
(15S)-16-oxa-8,9,12,22,24-pentaazahexacyclo[15.6.2.1^{6,9}.1^{12,15}.0^{2,7}.0^{21,25}]heptacosa-1(24),2,4,6(27),7,17(25),18,20,22-nonaene-23,27-diol | CHEMBL385415
Type:
Small organic molecule
Emp. Form.:
C21H19N5O3
Mol. Mass.:
389.4073
SMILES:
O=c1n2CCN3CC[C@@H](C3)Oc3cccc4[nH]c(=O)c(nc34)-c3cccc1c3[nH]2
: