Target
Cyclin-dependent kinase 2
Ligand
BDBM50192076
Substrate
Meas. Tech.
ChEMBL_404510 (CHEMBL910893)
IC50
440±n/a nM
Citation
 Kawanishi, NSugimoto, TShibata, JNakamura, KMasutani, KIkuta, MHirai, H Structure-based drug design of a highly potent CDK1,2,4,6 inhibitor with novel macrocyclic quinoxalin-2-one structure. Bioorg Med Chem Lett 16:5122-6 (2006)  
Target
Name:
Cyclin-dependent kinase 2
Synonyms:
CDK2 CDK2_HUMAN Cell division protein kinase 2 Protein cereblon/Cyclin-dependent kinase 2 | p33 protein kinase
Type:
Enzyme Subunit
Mol. Mass.:
33938.17
Organism:
Homo sapiens (Human)
Description:
P24941
Residue:
298
  
Inhibitor
Name:
BDBM50192076
Synonyms:
1-{5-[((S)-5-chloro-indan-2-ylamino)-methyl]-1H-pyrazol-3-yl}-3-((S)-5-oxo-2,3,5,9b-tetrahydro-1H-pyrrolo[2,1-a]isoindol-9-yl)-urea CHEMBL336242
Type:
Small organic molecule
Emp. Form.:
C25H25ClN6O2
Mol. Mass.:
476.958
SMILES:
Clc1ccc2C[C@@H](Cc2c1)NCc1cc(NC(=O)Nc2cccc3C(=O)N4CCC[C@H]4c23)[nH]n1
: