Target
Cyclin-dependent kinase 4
Ligand
BDBM50192083
Substrate
Meas. Tech.
ChEMBL_404507 (CHEMBL910890)
IC50
160±n/a nM
Citation
 Kawanishi, NSugimoto, TShibata, JNakamura, KMasutani, KIkuta, MHirai, H Structure-based drug design of a highly potent CDK1,2,4,6 inhibitor with novel macrocyclic quinoxalin-2-one structure. Bioorg Med Chem Lett 16:5122-6 (2006)  
Target
Name:
Cyclin-dependent kinase 4
Synonyms:
CDK4 Cell division protein kinase 4 PSK-J3
Type:
Enzyme Subunit
Mol. Mass.:
33731.96
Organism:
Homo sapiens (Human)
Description:
P11802
Residue:
303
  
Inhibitor
Name:
BDBM50192083
Synonyms:
21-hydroxy-14-oxa-8-thia-9,20,22-triazapentacyclo[13.6.2.1^{6,9}.0^{2,7}.0^{19,23}]tetracosa-1(22),2,4,6,15(23),16,18,20-octaen-24-one | CHEMBL213364
Type:
Small organic molecule
Emp. Form.:
C19H15N3O3S
Mol. Mass.:
365.406
SMILES:
O=c1n2CCCCOc3cccc4[nH]c(=O)c(nc34)-c3cccc1c3s2
: