Target
Cyclin-dependent kinase 4
Ligand
BDBM50192080
Substrate
Meas. Tech.
ChEMBL_404507 (CHEMBL910890)
IC50
13±n/a nM
Citation
 Kawanishi, NSugimoto, TShibata, JNakamura, KMasutani, KIkuta, MHirai, H Structure-based drug design of a highly potent CDK1,2,4,6 inhibitor with novel macrocyclic quinoxalin-2-one structure. Bioorg Med Chem Lett 16:5122-6 (2006)  
Target
Name:
Cyclin-dependent kinase 4
Synonyms:
CDK4 Cell division protein kinase 4 PSK-J3
Type:
Enzyme Subunit
Mol. Mass.:
33731.96
Organism:
Homo sapiens (Human)
Description:
P11802
Residue:
303
  
Inhibitor
Name:
BDBM50192080
Synonyms:
9-methyl-8,9,10,11-tetrahydro-7H-16,18-(epiminomethano)-4,6-methanodibenzo[i,m][1,8,4,7,12]oxathiatriazacyclotetradecine-19,21-dione | CHEMBL1189501
Type:
Small organic molecule
Emp. Form.:
C20H19N5O3
Mol. Mass.:
377.3966
SMILES:
CN1CCOc2cccc3nc(O)c(nc23)-c2cccc3c(O)n(CC1)nc23
: