Target
Mu-type opioid receptor
Ligand
BDBM50199945
Substrate
Meas. Tech.
ChEMBL_422416 (CHEMBL909851)
Ki
0.980000±n/a nM
Citation
 Le Bourdonnec, BGoodman, AJGraczyk, TMBelanger, SSeida, PRDeHaven, RNDolle, RE Synthesis and pharmacological evaluation of novel octahydro-1H-pyrido[1,2-a]pyrazine as mu-opioid receptor antagonists. J Med Chem 49:7290-306 (2006)  
Target
Name:
Mu-type opioid receptor
Synonyms:
M-OR-1 MOR-1 MUOR1 Mu opiate receptor OPRM1 hMOP | mu-type opioid receptor isoform MOR-1
Type:
G Protein-Coupled Receptor (GPCR)
Mol. Mass.:
44789.51
Organism:
Homo sapiens (Human)
Description:
P35372
Residue:
400
  
Inhibitor
Name:
BDBM50199945
Synonyms:
3-((7R,8R,9alphaR)-7,8-dimethyl-2-(2-methylbenzyl)-octahydro-1H-pyrido[1,2-R]pyrazin-8-yl)phenol | CHEMBL219599
Type:
Small organic molecule
Emp. Form.:
C24H32N2O
Mol. Mass.:
364.5237
SMILES:
C[C@H]1CN2CCN(Cc3ccccc3C)C[C@H]2C[C@@]1(C)c1cccc(O)c1
: