Target
Peptide deformylase
Ligand
BDBM50201874
Substrate
Meas. Tech.
ChEMBL_423229 (CHEMBL913367)
IC50
50000±n/a nM
Citation
 Boularot, AGiglione, CPetit, SDuroc, YAlves de Sousa, RLarue, VCresteil, TDardel, FArtaud, IMeinnel, T Discovery and refinement of a new structural class of potent peptide deformylase inhibitors. J Med Chem 50:10-20 (2007)  
Target
Name:
Peptide deformylase
Synonyms:
3.5.1.88 BON94_18585 D9G11_25760 FORC82_p394 Polypeptide deformylase def | def_2
Type:
Mol. Mass.:
16901.39
Organism:
Escherichia coli
Description:
Residue:
150
  
Inhibitor
Name:
BDBM50201874
Synonyms:
CHEMBL425293 | N-[2-(5-bromo-2-methyl-1H-indole-3-yl)methyl]hydroxylamine
Type:
Small organic molecule
Emp. Form.:
C10H11BrN2O
Mol. Mass.:
255.111
SMILES:
Cc1[nH]c2ccc(Br)cc2c1CNO
: