Target
Adenosine receptor A1
Ligand
BDBM50202572
Substrate
Meas. Tech.
ChEMBL_423824 (CHEMBL911266)
Ki
610±n/a nM
Citation
 Baraldi, PGPreti, DTabrizi, MAFruttarolo, FRomagnoli, RCarrion, MDCara, LCMoorman, ARVarani, KBorea, PA Synthesis and biological evaluation of novel 1-deoxy-1-[6-[((hetero)arylcarbonyl)hydrazino]- 9H-purin-9-yl]-N-ethyl-beta-D-ribofuranuronamide derivatives as useful templates for the development of A2B adenosine receptor agonists. J Med Chem 50:374-80 (2007)  
Target
Name:
Adenosine receptor A1
Synonyms:
A1 adenosine receptor (hA1) AA1R_HUMAN ADORA1 Adenosine A1-receptor Adenosine receptor A1 (hA1) | Adenosine transporter (AdT)
Type:
G Protein-Coupled Receptor (GPCR)
Mol. Mass.:
36520.92
Organism:
Homo sapiens (Human)
Description:
P30542
Residue:
326
  
Inhibitor
Name:
BDBM50202572
Synonyms:
1-deoxy-1-{2-chloro-6-[N'-(1-H-pyrrole-2-carbonyl)-hydrazino]-9H-purin-9-yl}-N-ethyl-beta-D-ribofuranuronamide N'-(2-chloro-9-((2R,3R,4S,5S)-5-(ethylcarbamoyl)-3,4-dihydroxy-tetrahydrofuran-2-yl)-9H-purin-6-yl)-1H-pyrrole-2-carbohydrazide
Type:
Small organic molecule
Emp. Form.:
C17H19ClN8O5
Mol. Mass.:
450.836
SMILES:
CCNC(=O)[C@H]1O[C@H]([C@H](O)[C@@H]1O)n1cnc2c(NNC(=O)c3ccc[nH]3)nc(Cl)nc12
: