Target
Adenosine receptor A2a
Ligand
BDBM50205721
Substrate
Meas. Tech.
ChEMBL_428387 (CHEMBL917987)
Ki
6310±n/a nM
Citation
 Volpini, RDal Ben, DLambertucci, CTaffi, SVittori, SKlotz, KNCristalli, G N6-methoxy-2-alkynyladenosine derivatives as highly potent and selective ligands at the human A3 adenosine receptor. J Med Chem 50:1222-30 (2007)  
Target
Name:
Adenosine receptor A2a
Synonyms:
A2A adenosine receptor (hA2A) ADENOSINE A2 ADORA2 Adenosine A2A receptor (A2AAR)
Type:
G Protein-Coupled Receptor (GPCR)
Mol. Mass.:
44716.46
Organism:
Homo sapiens (Human)
Description:
P29274
Residue:
412
  
Inhibitor
Name:
BDBM50205721
Synonyms:
CHEMBL220899 | N6-methoxy-2-[(4-pyridinyl)ethynyl]adenosine
Type:
Small organic molecule
Emp. Form.:
C18H18N6O5
Mol. Mass.:
398.3727
SMILES:
CONc1nc(nc2n(cnc12)[C@@H]1O[C@H](CO)[C@@H](O)[C@H]1O)C#Cc1ccncc1
: