Target
Glutamate receptor 2
Ligand
BDBM50178136
Substrate
Meas. Tech.
ChEMBL_429155 (CHEMBL914410)
IC50
>300000±n/a nM
Citation
 Dolman, NPMore, JCAlt, AKnauss, JLPentikäinen, OTGlasser, CRBleakman, DMayer, MLCollingridge, GLJane, DE Synthesis and pharmacological characterization of N3-substituted willardiine derivatives: role of the substituent at the 5-position of the uracil ring in the development of highly potent and selective GLUK5 kainate receptor antagonists. J Med Chem 50:1558-70 (2007)  
Target
Name:
Glutamate receptor 2
Synonyms:
AMPA-selective glutamate receptor 2 GRIA2 GluR-2 GluR-K2 Glutamate receptor 2 Glutamate receptor AMPA 2/3 Glutamate receptor ionotropic, AMPA 2
Type:
Enzyme Catalytic Domain
Mol. Mass.:
98825.96
Organism:
Homo sapiens (Human)
Description:
Glutamate AMPA 2 GRIA2 HUMAN::P42262
Residue:
883
  
Inhibitor
Name:
BDBM50178136
Synonyms:
(S)-1-(2-amino-2-carboxyethyl)-3-(2-carboxybenzyl)-pyrimidine-2,4-dione (S)-2-((3-(2-amino-2-carboxyethyl)-2,6-dioxo-2,3-dihydropyrimidin-1(6H)-yl)methyl)benzoic acid UBP-302
Type:
Small organic molecule
Emp. Form.:
C15H15N3O6
Mol. Mass.:
333.2961
SMILES:
N[C@@H](Cn1ccc(=O)n(Cc2ccccc2C(O)=O)c1=O)C(O)=O
: