Target
Glutamate receptor 2
Ligand
BDBM50207594
Substrate
Meas. Tech.
ChEMBL_429155 (CHEMBL914410)
IC50
2500±n/a nM
Citation
 Dolman, NPMore, JCAlt, AKnauss, JLPentikäinen, OTGlasser, CRBleakman, DMayer, MLCollingridge, GLJane, DE Synthesis and pharmacological characterization of N3-substituted willardiine derivatives: role of the substituent at the 5-position of the uracil ring in the development of highly potent and selective GLUK5 kainate receptor antagonists. J Med Chem 50:1558-70 (2007)  
Target
Name:
Glutamate receptor 2
Synonyms:
AMPA-selective glutamate receptor 2 GRIA2 GluR-2 GluR-K2 Glutamate receptor 2 Glutamate receptor AMPA 2/3 Glutamate receptor ionotropic, AMPA 2
Type:
Enzyme Catalytic Domain
Mol. Mass.:
98825.96
Organism:
Homo sapiens (Human)
Description:
Glutamate AMPA 2 GRIA2 HUMAN::P42262
Residue:
883
  
Inhibitor
Name:
BDBM50207594
Synonyms:
2,3-Dihydroxy-6-nitro-benzo[f]quinoxaline-7-sulfonic acid amide 2,3-dihydroxy-6-nitro-7-sulfamoylbenzo(f)quinoxaline 6-Nitro-2,3-dioxo-1,2,3,4,4a,10b-hexahydro-benzo[f]quinoxaline-7-sulfonic acid amide 6-Nitro-2,3-dioxo-1,2,3,4-tetrahydro-benzo[f]quinoxaline-7-sulfonic acid amide 6-nitro-2,3-dioxo-1,2,3,4-tetrahydrobenzo[f]quinoxaline-7-sulfonamide | CHEMBL222519
Type:
Small organic molecule
Emp. Form.:
C12H8N4O6S
Mol. Mass.:
336.28
SMILES:
NS(=O)(=O)c1cccc2c1c(cc1[nH]c(=O)c(=O)[nH]c21)[N+]([O-])=O
: