Target
ATP-dependent translocase ABCB1
Ligand
BDBM50207961
Substrate
Meas. Tech.
ChEMBL_429163 (CHEMBL914418)
EC50
18±n/a nM
Citation
 Kaiser, DTerfloth, LKopp, SSchulz, Jde Laet, RChiba, PEcker, GFGasteiger, J Self-organizing maps for identification of new inhibitors of P-glycoprotein. J Med Chem 50:1698-702 (2007)  
Target
Name:
ATP-dependent translocase ABCB1
Synonyms:
ABCB1 MDR1_HUMAN Multidrug resistance protein 1 P-glycoprotein (P-gp) PGY1
Type:
Protein
Mol. Mass.:
141503.50
Organism:
Homo sapiens (Human)
Description:
P08183
Residue:
1280
  
Inhibitor
Name:
BDBM50207961
Synonyms:
1-(2-(2-hydroxy-3-(4-o-tolylpiperazin-1-yl)propoxy)phenyl)-3-p-tolylpropan-1-one | CHEMBL223105
Type:
Small organic molecule
Emp. Form.:
C30H36N2O3
Mol. Mass.:
472.6184
SMILES:
Cc1ccc(CCC(=O)c2ccccc2OCC(O)CN2CCN(CC2)c2ccccc2C)cc1
: