Target
ATP-dependent translocase ABCB1
Ligand
BDBM50135028
Substrate
Meas. Tech.
ChEMBL_429163 (CHEMBL914418)
EC50
27±n/a nM
Citation
 Kaiser, DTerfloth, LKopp, SSchulz, Jde Laet, RChiba, PEcker, GFGasteiger, J Self-organizing maps for identification of new inhibitors of P-glycoprotein. J Med Chem 50:1698-702 (2007)  
Target
Name:
ATP-dependent translocase ABCB1
Synonyms:
ABCB1 MDR1_HUMAN Multidrug resistance protein 1 P-glycoprotein (P-gp) PGY1
Type:
Protein
Mol. Mass.:
141503.50
Organism:
Homo sapiens (Human)
Description:
P08183
Residue:
1280
  
Inhibitor
Name:
BDBM50135028
Synonyms:
1-(2-(2-hydroxy-3-(4-o-tolylpiperazin-1-yl)propoxy)phenyl)-3-phenylpropan-1-one CHEMBL96597
Type:
Small organic molecule
Emp. Form.:
C29H34N2O3
Mol. Mass.:
458.5919
SMILES:
Cc1ccccc1N1CCN(CC(O)COc2ccccc2C(=O)CCc2ccccc2)CC1
: