Target
Delta-type opioid receptor
Ligand
BDBM50157800
Substrate
Meas. Tech.
ChEMBL_430155 (CHEMBL919064)
Ki
3±n/a nM
Citation
 Srivastava, SKShefali, SMiller, CNAceto, MDTraynor, JRLewis, JWHusbands, SM Effects of substitution on the pyrrole N atom in derivatives of tetrahydronaltrindole, tetrahydrooxymorphindole, and a related 4,5-epoxyphenylpyrrolomorphinan. J Med Chem 47:6645-8 (2004)  
Target
Name:
Delta-type opioid receptor
Synonyms:
D-OR-1 Delta opioid receptor OPIATE Delta OPRD1 OPRK1 | opioid receptor, delta 1
Type:
G Protein-Coupled Receptor (GPCR)
Mol. Mass.:
40382.98
Organism:
Homo sapiens (Human)
Description:
Competition binding assays were carried out using membrane preparations from transfected HN9.10 cells that constitutively expressed the delta opioid receptor.
Residue:
372
  
Inhibitor
Name:
BDBM50157800
Synonyms:
(1S,2S,9R)-18-(cyclopropylmethyl)-7-ethyl-5-phenyl-10-oxa-7,18-diazahexacyclo[9.9.1.0^{1,9}.0^{2,17}.0^{4,8}.0^{15,21}]henicosa-4(8),5,11,13,15(21)-pentaene-2,12-diol | CHEMBL373910
Type:
Small organic molecule
Emp. Form.:
C30H32N2O3
Mol. Mass.:
468.5867
SMILES:
CCn1cc(c2C[C@@]3(O)C4Cc5ccc(O)c6O[C@@H](c12)[C@]3(CCN4CC1CC1)c56)-c1ccccc1
: