Target
Delta-type opioid receptor
Ligand
BDBM50157790
Substrate
Meas. Tech.
ChEMBL_430155 (CHEMBL919064)
Ki
4.2±n/a nM
Citation
 Srivastava, SKShefali, SMiller, CNAceto, MDTraynor, JRLewis, JWHusbands, SM Effects of substitution on the pyrrole N atom in derivatives of tetrahydronaltrindole, tetrahydrooxymorphindole, and a related 4,5-epoxyphenylpyrrolomorphinan. J Med Chem 47:6645-8 (2004)  
Target
Name:
Delta-type opioid receptor
Synonyms:
D-OR-1 Delta opioid receptor OPIATE Delta OPRD1 OPRK1 | opioid receptor, delta 1
Type:
G Protein-Coupled Receptor (GPCR)
Mol. Mass.:
40382.98
Organism:
Homo sapiens (Human)
Description:
Competition binding assays were carried out using membrane preparations from transfected HN9.10 cells that constitutively expressed the delta opioid receptor.
Residue:
372
  
Inhibitor
Name:
BDBM50157790
Synonyms:
1'-cyclohexylmethyl-6,7-didehydro-3,14-dihydroxy-4,5alpha-epoxy-17-methyl-4',5',6',7'-tetrahydroindolo[2',3':6,7]morphinan | CHEMBL222579
Type:
Small organic molecule
Emp. Form.:
C30H38N2O3
Mol. Mass.:
474.6343
SMILES:
CN1CC[C@@]23[C@H]4Oc5c2c(CC1[C@]3(O)Cc1c2CCCCc2n(CC2CCCCC2)c41)ccc5O
: