Target
Mu-type opioid receptor
Ligand
BDBM50157793
Substrate
Meas. Tech.
ChEMBL_430156 (CHEMBL919065)
EC50
222±n/a nM
Citation
 Srivastava, SKShefali, SMiller, CNAceto, MDTraynor, JRLewis, JWHusbands, SM Effects of substitution on the pyrrole N atom in derivatives of tetrahydronaltrindole, tetrahydrooxymorphindole, and a related 4,5-epoxyphenylpyrrolomorphinan. J Med Chem 47:6645-8 (2004)  
Target
Name:
Mu-type opioid receptor
Synonyms:
M-OR-1 MOR-1 MUOR1 Mu opiate receptor OPRM1 hMOP | mu-type opioid receptor isoform MOR-1
Type:
G Protein-Coupled Receptor (GPCR)
Mol. Mass.:
44789.51
Organism:
Homo sapiens (Human)
Description:
P35372
Residue:
400
  
Inhibitor
Name:
BDBM50157793
Synonyms:
6,7-didehydro-3,14-dihydroxy-1'17-dimethyl-4,5 alpha-epoxy-4',5',6',7'-tetrahydroindolo[2',3';6,7]morphinan | CHEMBL374228
Type:
Small organic molecule
Emp. Form.:
C24H28N2O3
Mol. Mass.:
392.4907
SMILES:
CN1CC[C@@]23[C@H]4Oc5c2c(CC1[C@]3(O)Cc1c2CCCCc2n(C)c41)ccc5O
: