Target
Mu-type opioid receptor
Ligand
BDBM50157800
Substrate
Meas. Tech.
ChEMBL_430153 (CHEMBL919062)
Ki
8.8±n/a nM
Citation
 Srivastava, SKShefali, SMiller, CNAceto, MDTraynor, JRLewis, JWHusbands, SM Effects of substitution on the pyrrole N atom in derivatives of tetrahydronaltrindole, tetrahydrooxymorphindole, and a related 4,5-epoxyphenylpyrrolomorphinan. J Med Chem 47:6645-8 (2004)  
Target
Name:
Mu-type opioid receptor
Synonyms:
M-OR-1 MOR-1 MUOR1 Mu opiate receptor OPRM1 hMOP | mu-type opioid receptor isoform MOR-1
Type:
G Protein-Coupled Receptor (GPCR)
Mol. Mass.:
44789.51
Organism:
Homo sapiens (Human)
Description:
P35372
Residue:
400
  
Inhibitor
Name:
BDBM50157800
Synonyms:
(1S,2S,9R)-18-(cyclopropylmethyl)-7-ethyl-5-phenyl-10-oxa-7,18-diazahexacyclo[9.9.1.0^{1,9}.0^{2,17}.0^{4,8}.0^{15,21}]henicosa-4(8),5,11,13,15(21)-pentaene-2,12-diol | CHEMBL373910
Type:
Small organic molecule
Emp. Form.:
C30H32N2O3
Mol. Mass.:
468.5867
SMILES:
CCn1cc(c2C[C@@]3(O)C4Cc5ccc(O)c6O[C@@H](c12)[C@]3(CCN4CC1CC1)c56)-c1ccccc1
: