Target
Kappa-type opioid receptor
Ligand
BDBM50157794
Substrate
Meas. Tech.
ChEMBL_430154 (CHEMBL919063)
Ki
163±n/a nM
Citation
 Srivastava, SKShefali, SMiller, CNAceto, MDTraynor, JRLewis, JWHusbands, SM Effects of substitution on the pyrrole N atom in derivatives of tetrahydronaltrindole, tetrahydrooxymorphindole, and a related 4,5-epoxyphenylpyrrolomorphinan. J Med Chem 47:6645-8 (2004)  
Target
Name:
Kappa-type opioid receptor
Synonyms:
K-OR-1 Kappa-opioid receptor (KOR) Kappa-type opioid receptor (KOR) OPIATE Kappa OPRK1 kappa opioid receptor (KOR)
Type:
G Protein-Coupled Receptor (GPCR)
Mol. Mass.:
42648.76
Organism:
Homo sapiens (Human)
Description:
P41145
Residue:
380
  
Inhibitor
Name:
BDBM50157794
Synonyms:
6,7-didehydro-3,14-dihydroxy-4,5alpha-epoxy-17-methyl-1'phenylethyl-4',5',6',7'-tetrahydroindolo[2',3':6,7]morphinan | CHEMBL222814
Type:
Small organic molecule
Emp. Form.:
C31H34N2O3
Mol. Mass.:
482.6133
SMILES:
CN1CC[C@@]23[C@H]4Oc5c2c(CC1[C@]3(O)Cc1c2CCCCc2n(CCc2ccccc2)c41)ccc5O
: