Target
Kappa-type opioid receptor
Ligand
BDBM50157796
Substrate
Meas. Tech.
ChEMBL_430154 (CHEMBL919063)
Ki
168±n/a nM
Citation
 Srivastava, SKShefali, SMiller, CNAceto, MDTraynor, JRLewis, JWHusbands, SM Effects of substitution on the pyrrole N atom in derivatives of tetrahydronaltrindole, tetrahydrooxymorphindole, and a related 4,5-epoxyphenylpyrrolomorphinan. J Med Chem 47:6645-8 (2004)  
Target
Name:
Kappa-type opioid receptor
Synonyms:
K-OR-1 Kappa-opioid receptor (KOR) Kappa-type opioid receptor (KOR) OPIATE Kappa OPRK1 kappa opioid receptor (KOR)
Type:
G Protein-Coupled Receptor (GPCR)
Mol. Mass.:
42648.76
Organism:
Homo sapiens (Human)
Description:
P41145
Residue:
380
  
Inhibitor
Name:
BDBM50157796
Synonyms:
6,7-didehydro-3,14-dihydroxy-4,5alpha-epoxy-1'-ethyl-17-methyl-4',5',6',7'-tetrahydroindolo'2',3';6,7]morphinan | CHEMBL222704
Type:
Small organic molecule
Emp. Form.:
C25H30N2O3
Mol. Mass.:
406.5173
SMILES:
CCn1c2CCCCc2c2C[C@@]3(O)C4Cc5ccc(O)c6O[C@@H](c12)[C@]3(CCN4C)c56
: