Target
Cannabinoid receptor 1
Ligand
BDBM50176949
Substrate
Meas. Tech.
ChEMBL_430944 (CHEMBL914886)
Ki
>10000±n/a nM
Citation
 Brizzi, ABrizzi, VCascio, MGBisogno, TSirianni, RDi Marzo, V Design, synthesis, and binding studies of new potent ligands of cannabinoid receptors. J Med Chem 48:7343-50 (2005)  
Target
Name:
Cannabinoid receptor 1
Synonyms:
CANN6 CB-R CNR CNR1_HUMAN Cannabinoid receptor Cannabinoid receptor 1 (brain)
Type:
G Protein-Coupled Receptor (GPCR)
Mol. Mass.:
52868.96
Organism:
Homo sapiens (Human)
Description:
P21554
Residue:
472
  
Inhibitor
Name:
BDBM50176949
Synonyms:
11-(3-hydroxyphenoxy)undecanoic acid cyclopropilamide | CHEMBL225342
Type:
Small organic molecule
Emp. Form.:
C20H31NO3
Mol. Mass.:
333.465
SMILES:
Oc1cccc(OCCCCCCCCCCC(=O)NC2CC2)c1
: