Target
Cannabinoid receptor 2
Ligand
BDBM50215240
Substrate
Meas. Tech.
ChEMBL_437162 (CHEMBL906559)
Ki
39±n/a nM
Citation
 Brizzi, ACascio, MGBrizzi, VBisogno, TDinatolo, MTMartinelli, ATuccinardi, TDi Marzo, V Design, synthesis, binding, and molecular modeling studies of new potent ligands of cannabinoid receptors. Bioorg Med Chem 15:5406-16 (2007)  
Target
Name:
Cannabinoid receptor 2
Synonyms:
CANNABINOID CB2 CB2 CB2B CNR2_HUMAN Cannabinoid CB2 receptor Cannabinoid receptor 2 (CB2R) | hCB2
Type:
G Protein-Coupled Receptor (GPCR)
Mol. Mass.:
39690.94
Organism:
Homo sapiens (Human)
Description:
P34972
Residue:
360
  
Inhibitor
Name:
BDBM50215240
Synonyms:
8-(3-hydroxy-5-pentyl-phenoxy)-octanoic acid cyclopropylamide | CHEMBL228347
Type:
Small organic molecule
Emp. Form.:
C22H35NO3
Mol. Mass.:
361.5182
SMILES:
CCCCCc1cc(O)cc(OCCCCCCCC(=O)NC2CC2)c1
: