Target
Phosphoenolpyruvate carboxykinase, cytosolic [GTP]
Ligand
BDBM50214013
Substrate
Meas. Tech.
ChEMBL_438956 (CHEMBL889299)
IC50
1950±n/a nM
Citation
 Pietranico, SLFoley, LHHuby, NYun, WDunten, PVermeulen, JWang, PToth, KRamsey, GGubler, MLWertheimer, SJ C-8 Modifications of 3-alkyl-1,8-dibenzylxanthines as inhibitors of human cytosolic phosphoenolpyruvate carboxykinase. Bioorg Med Chem Lett 17:3835-9 (2007)  
Target
Name:
Phosphoenolpyruvate carboxykinase, cytosolic [GTP]
Synonyms:
PCK1 PEPCK1 | Phosphoenolpyruvate carboxykinase cytosolic
Type:
PROTEIN
Mol. Mass.:
69189.74
Organism:
Homo sapiens (Human)
Description:
ChEMBL_438956
Residue:
622
  
Inhibitor
Name:
BDBM50214013
Synonyms:
CHEMBL242486 | N-(4-((1-(2-fluorobenzyl)-3-(cyclopropylmethyl)-2,6-dioxo-2,3,6,7-tetrahydro-1H-purin-8-yl)methyl)phenyl)pyridine-3-sulfonamide
Type:
Small organic molecule
Emp. Form.:
C28H25FN6O4S
Mol. Mass.:
560.599
SMILES:
Fc1ccccc1Cn1c(=O)n(CC2CC2)c2nc(Cc3ccc(NS(=O)(=O)c4cccnc4)cc3)[nH]c2c1=O
: