Target
Glutamate receptor 3
Ligand
BDBM50166287
Substrate
Meas. Tech.
ChEMBL_445375 (CHEMBL895666)
EC50
700000±n/a nM
Citation
 Jensen, AAChristesen, TBølcho, UGreenwood, JRPostorino, GVogensen, SBJohansen, TNEgebjerg, JBräuner-Osborne, HClausen, RP Functional characterization of Tet-AMPA [tetrazolyl-2-amino-3-(3-hydroxy-5-methyl- 4-isoxazolyl)propionic acid] analogues at ionotropic glutamate receptors GluR1-GluR4. The molecular basis for the functional selectivity profile of 2-Bn-Tet-AMPA. J Med Chem 50:4177-85 (2007)  
Target
Name:
Glutamate receptor 3
Synonyms:
AMPA-selective glutamate receptor 3 GLURC GRIA3_HUMAN GluR-C Glutamate receptor 3 Glutamate receptor ionotropic, AMPA 3
Type:
PROTEIN
Mol. Mass.:
101172.14
Organism:
Homo sapiens (Human)
Description:
ChEMBL_468627
Residue:
894
  
Inhibitor
Name:
BDBM50166287
Synonyms:
(RS)-2-amino-3-[3-hydroxy-5-(2-isopropyl-2H-5-tetrazolyl)-4-isoxazolyl]propionic acid 2-amino-3-(3-hydroxy-5-(2-isopropyl-2H-tetrazol-5-yl)isoxazol-4-yl)propanoic acid | CHEMBL193087
Type:
Small organic molecule
Emp. Form.:
C10H14N6O4
Mol. Mass.:
282.256
SMILES:
CC(C)n1nnc(n1)-c1o[nH]c(=O)c1CC(N)C(O)=O
: