Target
Glutamate receptor 1
Ligand
BDBM50166287
Substrate
Meas. Tech.
ChEMBL_445371 (CHEMBL895662)
EC50
550000±n/a nM
Citation
 Jensen, AAChristesen, TBølcho, UGreenwood, JRPostorino, GVogensen, SBJohansen, TNEgebjerg, JBräuner-Osborne, HClausen, RP Functional characterization of Tet-AMPA [tetrazolyl-2-amino-3-(3-hydroxy-5-methyl- 4-isoxazolyl)propionic acid] analogues at ionotropic glutamate receptors GluR1-GluR4. The molecular basis for the functional selectivity profile of 2-Bn-Tet-AMPA. J Med Chem 50:4177-85 (2007)  
Target
Name:
Glutamate receptor 1
Synonyms:
AMPA-selective glutamate receptor 1 GLUR1 GRIA1_HUMAN GluR-A Glutamate AMPA 1 Glutamate receptor AMPA 1/2 Glutamate receptor ionotropic, AMPA 1
Type:
Enzyme Catalytic Domain
Mol. Mass.:
101512.92
Organism:
Homo sapiens (Human)
Description:
Glutamate AMPA 1 GRIA1 HUMAN::P42261
Residue:
906
  
Inhibitor
Name:
BDBM50166287
Synonyms:
(RS)-2-amino-3-[3-hydroxy-5-(2-isopropyl-2H-5-tetrazolyl)-4-isoxazolyl]propionic acid 2-amino-3-(3-hydroxy-5-(2-isopropyl-2H-tetrazol-5-yl)isoxazol-4-yl)propanoic acid | CHEMBL193087
Type:
Small organic molecule
Emp. Form.:
C10H14N6O4
Mol. Mass.:
282.256
SMILES:
CC(C)n1nnc(n1)-c1o[nH]c(=O)c1CC(N)C(O)=O
: