Target
5-hydroxytryptamine receptor 3A
Ligand
BDBM50220057
Substrate
Meas. Tech.
ChEMBL_445995 (CHEMBL896288)
IC50
31623±n/a nM
Citation
 Jensen, AAZlotos, DPLiljefors, T Pharmacological characteristics and binding modes of caracurine V analogues and related compounds at the neuronal alpha7 nicotinic acetylcholine receptor. J Med Chem 50:4616-29 (2007)  
Target
Name:
5-hydroxytryptamine receptor 3A
Synonyms:
5-HT-3 5-HT3A 5-hydroxytryptamine receptor 3 (5-HT3) 5-hydroxytryptamine receptor 3A (5HT3A) 5HT3R HTR3A Serotonin 3 receptor (5HT3) Serotonin-gated ion channel receptor | Serotonin-gated ion channel receptor 3
Type:
Protein
Mol. Mass.:
55283.27
Organism:
Homo sapiens (Human)
Description:
P46098
Residue:
478
  
Inhibitor
Name:
BDBM50220057
Synonyms:
(1S,9R,18R,19S,21R,22R,23R,25R,32S,34R,35R,36S)-15,31-bis[(3,4-dimethoxyphenyl)methyl]-24-phenyl-10,26-dioxa-8,15,24,31-tetraazaundecacyclo[29.5.2.0^{1,32}.0^{2,7}.0^{8,36}.0^{9,22}.0^{13,21}.0^{15,19}.0^{18,23}.0^{25,35}.0^{29,34}]octatriaconta-2,4,6,12,28-pentaene-15,31-diium dichloride | CHEMBL389120
Type:
Small organic molecule
Emp. Form.:
C56H64N4O6
Mol. Mass.:
889.1295
SMILES:
COc1ccc(C[N+]23CC[C@H]4[C@@H]2C[C@@H]2[C@@H]5[C@@H]4N([C@@H]4OCC=C6C[N+]7(Cc8ccc(OC)c(OC)c8)CC[C@@]89[C@@H]7C[C@@H]6[C@@H]4[C@@H]8N([C@@H]5OCC=C2C3)c2ccccc92)c2ccccc2)cc1OC
: