Target
Neuronal acetylcholine receptor subunit alpha-7
Ligand
BDBM50366779
Substrate
Meas. Tech.
ChEMBL_445990 (CHEMBL896283)
Ki
1.000000±n/a nM
Citation
 Jensen, AAZlotos, DPLiljefors, T Pharmacological characteristics and binding modes of caracurine V analogues and related compounds at the neuronal alpha7 nicotinic acetylcholine receptor. J Med Chem 50:4616-29 (2007)  
Target
Name:
Neuronal acetylcholine receptor subunit alpha-7
Synonyms:
ACHA7_HUMAN Cholinergic, Nicotinic Alpha7 Neuronal acetylcholine receptor protein alpha-7 subunit Nicotinic acetylcholine receptor alpha-7 (alpha7 nAChR)
Type:
Mol. Mass.:
56448.33
Organism:
Homo sapiens (Human)
Description:
CHRNA7 (NACHRA7)
Residue:
502
  
Inhibitor
Name:
BDBM50366779
Synonyms:
METHYLLYCACONITINE
Type:
Small organic molecule
Emp. Form.:
C37H50N2O10
Mol. Mass.:
682.8003
SMILES:
CCN1C[C@]2(COC(=O)c3ccccc3-n3c(O)cc(C)c3O)CC[C@H](OC)[C@@]34[C@@H]5C[C@H]6[C@H](OC)[C@@H]5[C@](O)(C[C@@H]6OC)[C@](O)([C@@H](OC)[C@H]23)[C@H]14
: