Target
Urokinase-type plasminogen activator
Ligand
BDBM50216556
Substrate
Meas. Tech.
ChEMBL_447833 (CHEMBL898083)
Ki
>14000±n/a nM
Citation
 Qiao, JXChang, CHCheney, DLMorin, PEWang, GZKing, SRWang, TCRendina, ARLuettgen, JMKnabb, RMWexler, RRLam, PY SAR and X-ray structures of enantiopure 1,2-cis-(1R,2S)-cyclopentyldiamine and cyclohexyldiamine derivatives as inhibitors of coagulation Factor Xa. Bioorg Med Chem Lett 17:4419-27 (2007)  
Target
Name:
Urokinase-type plasminogen activator
Synonyms:
3.4.21.73 U-plasminogen activator Urokinase Urokinase-type plasminogen activator chain B Urokinase-type plasminogen activator short chain A uPA
Type:
Enzyme
Mol. Mass.:
48528.62
Organism:
Homo sapiens (Human)
Description:
P00749
Residue:
431
  
Inhibitor
Name:
BDBM50216556
Synonyms:
3-CHLORO-N-((1R,2S) -2-(4-(2-OXOPYRIDIN-1(2H)-YL)BENZAMIDO)CYCLOHEXYL)-1H-INDOLE-6-CARBOXAMIDE CHEMBL398380
Type:
Small organic molecule
Emp. Form.:
C27H25ClN4O3
Mol. Mass.:
488.965
SMILES:
Clc1c[nH]c2cc(ccc12)C(=O)N[C@@H]1CCCC[C@@H]1NC(=O)c1ccc(cc1)-n1ccccc1=O
: