Target
Mineralocorticoid receptor
Ligand
BDBM50201104
Substrate
Meas. Tech.
ChEMBL_448944 (CHEMBL899207)
IC50
130±n/a nM
Citation
 Kuzmich, DKirrane, TProudfoot, JBekkali, YZindell, RBeck, LNelson, RShih, CKKukulka, AJPaw, ZReilly, PDeleon, RCardozo, MNabozny, GThomson, D Identification of dissociated non-steroidal glucocorticoid receptor agonists. Bioorg Med Chem Lett 17:5025-31 (2007)  
Target
Name:
Mineralocorticoid receptor
Synonyms:
MCR MLR NR3C2 | Nuclear receptor subfamily 3 group C member 2
Type:
Enzyme
Mol. Mass.:
107076.42
Organism:
Homo sapiens (Human)
Description:
P08235
Residue:
984
  
Inhibitor
Name:
BDBM50201104
Synonyms:
4-(5-fluoro-2-methoxyphenyl)-2-hydroxy-4-methyl-N-(4-methyl-1-oxo-1H-benzo[d][1,2]oxazin-6-yl)-2-(trifluoromethyl)pentanamide | CHEMBL263091
Type:
Small organic molecule
Emp. Form.:
C23H22F4N2O5
Mol. Mass.:
482.4248
SMILES:
COc1ccc(F)cc1C(C)(C)CC(O)(C(=O)Nc1ccc2c(c1)c(C)noc2=O)C(F)(F)F
: