Target
Calcium/calmodulin-dependent protein kinase type 1
Ligand
BDBM50222913
Substrate
Meas. Tech.
ChEMBL_450005 (CHEMBL899104)
IC50
2130±n/a nM
Citation
 Teng, MZhu, JJohnson, MDChen, PKornmann, JChen, EBlasina, ARegister, JAnderes, KRogers, CDeng, YNinkovic, SGrant, SHu, QLundgren, KPeng, ZKania, RS Structure-based design and synthesis of (5-arylamino-2H-pyrazol-3-yl)-biphenyl-2',4'-diols as novel and potent human CHK1 inhibitors. J Med Chem 50:5253-6 (2007)  
Target
Name:
Calcium/calmodulin-dependent protein kinase type 1
Synonyms:
CAMK1 CaM kinase I alpha CaMKI-alpha KCC1A_HUMAN
Type:
PROTEIN
Mol. Mass.:
41325.04
Organism:
Homo sapiens (Human)
Description:
ChEMBL_655701
Residue:
370
  
Inhibitor
Name:
BDBM50222913
Synonyms:
4'-{5-[4-(isopropylamino-methyl)-phenylamino]-2H-pyrazol-3-yl}-biphenyl-2,4-diol | CHEMBL398606
Type:
Small organic molecule
Emp. Form.:
C25H26N4O2
Mol. Mass.:
414.4995
SMILES:
CC(C)NCc1ccc(Nc2cc(n[nH]2)-c2ccc(cc2)-c2ccc(O)cc2O)cc1
: