Target
Muscarinic acetylcholine receptor M2
Ligand
BDBM50149891
Substrate
Meas. Tech.
ChEMBL_451100 (CHEMBL900173)
EC50
130±n/a nM
Citation
 Elsinghorst, PWCieslik, JSMohr, KTränkle, CGütschow, M First gallamine-tacrine hybrid: design and characterization at cholinesterases and the M2 muscarinic receptor. J Med Chem 50:5685-95 (2007)  
Target
Name:
Muscarinic acetylcholine receptor M2
Synonyms:
ACM2_PIG Cholinergic, muscarinic LOC100715343 Muscarinic receptor 2
Type:
Enzyme Catalytic Domain
Mol. Mass.:
51688.65
Organism:
GUINEA PIG
Description:
Cholinergic, muscarinic 0 GUINEA PIG::P06199
Residue:
466
  
Inhibitor
Name:
BDBM50149891
Synonyms:
2,2',2''-[1,2,3-BENZENE-TRIYLTRIS(OXY)]TRIS[N,N,N-TRIETHYLETHANAMINIUM] GALLAMINE
Type:
Small organic molecule
Emp. Form.:
C30H60N3O3
Mol. Mass.:
510.8141
SMILES:
CC[N+](CC)(CC)CCOc1cccc(OCC[N+](CC)(CC)CC)c1OCC[N+](CC)(CC)CC
: