Target
Cytochrome P450 2C9
Ligand
BDBM50228550
Substrate
Meas. Tech.
ChEMBL_452859 (CHEMBL903102)
IC50
>100000±n/a nM
Citation
 Procopiou, PAAncliff, RABamford, MJBrowning, CConnor, HDavies, SFogden, YCHodgson, STHolmes, DSLooker, BEMorriss, KMParr, CAPickup, EASehmi, SSWhite, GVWatts, CJWilson, DMWoodrow, MD 4-acyl-1-(4-aminoalkoxyphenyl)-2-ketopiperazines as a novel class of non-brain-penetrant histamine H3 receptor antagonists. J Med Chem 50:6706-17 (2007)  
Target
Name:
Cytochrome P450 2C9
Synonyms:
(R)-limonene 6-monooxygenase CP2C9_HUMAN CYP2C9 Cytochrome P450 2C9 (CYP2C9 ) P-450MP P450 PB-1 | S-mephenytoin 4-hydroxylase
Type:
Enzyme
Mol. Mass.:
55636.33
Organism:
Homo sapiens (Human)
Description:
P11712
Residue:
490
  
Inhibitor
Name:
BDBM50228550
Synonyms:
(R)-4-(2,4-difluorobenzoyl)-1-(4-(3-(2-methylpyrrolidin-1-yl)propoxy)phenyl)piperazin-2-one formic acid | CHEMBL239299
Type:
Small organic molecule
Emp. Form.:
C25H29F2N3O3
Mol. Mass.:
457.5129
SMILES:
C[C@@H]1CCCN1CCCOc1ccc(cc1)N1CCN(CC1=O)C(=O)c1ccc(F)cc1F
: